kuva-ala
broader: fyysiset ominaisuudet
comment: Kuvassa näkyvä alue; filmin pinnan kerrallaan valotettava alue.
in scheme: conceptscheme
type: Concept

fyysiset ominaisuudet
type: Concept
narrower: kuva-ala