kirjastot
preferred label: bibliotek @sv
preferred label: libraries @en
type: Concept
narrower: mediateekit

mediateekit
broader: kirjastot
comment: Multimedioita ym. sähköistä aineistoa sisältävä kirjasto.
in scheme: conceptscheme
type: Concept

kirjastot
type: Concept
narrower: mediateekit