radiologia
broader: luonnontieteet
comment: Kuvantamismenetelmiä (esim. röntgen-, ultraääni- ja magneettikuvaus) ja sädehoitoa käsittelevä lääketieteen haara.
in scheme: conceptscheme
type: Concept

radiologia
preferred label: radiologi @sv
preferred label: radiology @en
type: Concept

luonnontieteet
type: Concept
narrower: radiologia