subtraktiivinen värijärjestelmä
broader: värijärjestelmät (tekniset järjestelmät)
comment: Vähentävä värijärjestelmä. Perustuu syaaniin, magentaan ja keltaiseen ja mustaan. Väripigmentistä ja sideaineesta koostuvalla väriaineella vähennetään esim. valkoisesta paperista heijastuvan valon värien määrää.
alternative label: CMYK-järjestelmä
in scheme: conceptscheme
type: Concept

värijärjestelmät (tekniset järjestelmät)
type: Concept
narrower: subtraktiivinen värijärjestelmä