ilmaperspektiivi
broader: perspektiivi
comment: Ilman autereisuuden aiheuttama, ääripiirteiden ja värien hämärtyneisyytenä ilmenevä syvyysvaikutelma.
in scheme: conceptscheme
type: Concept

perspektiivi
type: Concept
narrower: ilmaperspektiivi

perspektiivi
preferred label: perspective @en
preferred label: perspektiv @sv
type: Concept
narrower: ilmaperspektiivi