liike
type: Concept
related: todellinen liike

sisäiset ominaisuudet
type: Concept
narrower: todellinen liike

todellinen liike
broader: sisäiset ominaisuudet
comment: Valokuvassa kuvataan todellista likettä.
related: liike
in scheme: conceptscheme
type: Concept