fotomekaaniset vedokset
type: Concept
narrower: rasteripainokuvat

rasteripainokuvat
broader: fotomekaaniset vedokset
comment: Rasteripainokuvat voivat olla dioja tai vedoksia.
alternative label: autotyypit
in scheme: conceptscheme
type: Concept