kameralla seurattu
broader: terävyysalue
comment: Kameraa liikutetaan siten, että liikkuvan kohteen kuva pysyy pitkähkön valotuksen aikana samalla kuvaruudun kohdalla. Näin saadaan liikkuvasta kohteesta terävä kuva taustan tullessa epäteräväksi.
in scheme: conceptscheme
type: Concept

terävyysalue
type: Concept
narrower: kameralla seurattu