kalibrointi
comment: Asteikkojen ja mittojen tarkka määritys vertaamalla tarkoin tunnettuun mittaan.
top concept of: conceptscheme
in scheme: conceptscheme
type: Concept

kalibrointi
preferred label: kalibrering @sv
preferred label: calibration @en
type: Concept