suuret kokokuvat
broader: rajaus
comment: Esittelee miljöön, kaikki kuvan kohteet näkyvät yhtä selkeästi.
in scheme: conceptscheme
type: Concept

rajaus
type: Concept
narrower: suuret kokokuvat

rajaus kuvakoon mukaan
type: Collection
member: suuret kokokuvat