mediataideteokset
type: Concept
narrower: videonauhateokset

videonauhateokset
broader: mediataideteokset
comment: Erilaisille videoformaateille (Betacam, u-matic, laserdisc, VHS, DVD, jne.) tallennettu ja sen kautta esitettäväksi tarkoitettu lineaarinen itsenäinen teos.
in scheme: conceptscheme
type: Concept