holografia
preferred label: holography @en
preferred label: holografi @sv
type: Concept

holografia
broader: kuvanvalmistusmenetelmät
source: Yleinen Suomalainen Asiasanasto#holografia
comment: Lasertekniikkaan perustuva kolmiulotteisten kuvien valmistus- ja esitysmenetelmä.
in scheme: conceptscheme
type: Concept

kuvanvalmistusmenetelmät
type: Concept
narrower: holografia