kollotypia
broader: fotomekaaniset menetelmät
comment: Valokuva vedostetaan lasilevyn pintaan sivellylle, lämpökäsitellylle gelatiinikerrokselle ja levyä käytetään painolaattana.
in scheme: conceptscheme
type: Concept

fotomekaaniset menetelmät
type: Concept
narrower: kollotypia