jyrkkyys
broader: fyysiset ominaisuudet
comment: Jyrkkyys filmissä: hyrkkä filmi toistaa heikosti harmaita välisävyjä mustan ja valkoisen välillä.
in scheme: conceptscheme
type: Concept

fyysiset ominaisuudet
type: Concept
narrower: jyrkkyys