Maailman kulttuurikehityksen vuosikymmen
broader: yhteiskunnallinen ajanjakso
scope note: Yhdistyneiden kansakuntien julistama vuosikymmen 1988-1997
in scheme: conceptscheme
type: Concept

yhteiskunnallinen ajanjakso
type: Concept
narrower: Maailman kulttuurikehityksen vuosikymmen