toisenlaiseksi muuttaminen
type: Concept
narrower: purkaminen (osiin)

purkaminen (osiin)
in scheme: conceptscheme
broader: toisenlaiseksi muuttaminen
related: hajotus
source: Kielitoimiston sanakirja
comment: saattaa jk kokonaisuus (takaisin) osiinsa t. aineksiinsa, irrottaa jnk osat t. ainekset toisistaan, hajottaa
alternative label: purku
alternative label: purkaminen
type: Concept
preferred label: rivning @sv

hajotus
preferred label: sönderdelning @sv
preferred label: disruption @en
type: Concept
related: purkaminen (osiin)