aine
preferred label: matter @en
preferred label: materia @sv
type: Concept
narrower: kiintoaines

kiintoaines
broader: aine
source: Aaltojen alla -sanasto
comment: veden mukana kulkevia, osin liuenneita kiinteiden aineiden hiukkasia, se voi olla epäorgaanista kivennäisainesta tai orgaanista ainetta
in scheme: conceptscheme
preferred label: sediment @sv
type: Concept