uskonnolliset yhteisöt
preferred label: religious communities @en
preferred label: religiösa samfund @sv
type: Concept
narrower: jakobiitit

jakobiitit
broader: uskonnolliset yhteisöt
scope note: Perustajansa Jakob Baradaeuksen mukaan nimensä saanut monofysiittinen kirkkokunta.Nykyisin jakobiittejä on lähinnä Syyriassa ja Irakissa
in scheme: conceptscheme
type: Concept