vuosilustot
type: Concept
source: Kielitoimiston sanakirja
comment: puun kuoren alle vuosittain kasvava puukerros (joka puun poikkileikkauksessa näkyy vuosirenkaana)
alternative label: lustot
alternative label: vuosirenkaat
broader: kasvinosat
in scheme: conceptscheme
preferred label: annual rings @en
preferred label: årsringar @sv

kasvinosat
type: Concept
narrower: vuosilustot
preferred label: växternas beståndsdelar @sv
preferred label: parts of plants @en