ekotase
type: Concept
alternative label: elinkaari-inventaario
alternative label: ympäristötase
broader: taseet
in scheme: conceptscheme
preferred label: ekobalans @sv
preferred label: ecobalance @en
scope note: Tarkoittaa tasetta, jossa eritellään tuotteeseen tai toimintaan liittyvät materiaali- ja energiavirrat raaka-aineiden käyttönä ja ympäristövaikutuksina
scope note: Avser en balansräkning där man specifierar hur produkter eller verksamheter i sina material- och energiströmmar använder råvaror och påverkar miljön. @sv

taseet
type: Concept
narrower: ekotase
preferred label: balansräkning @sv
preferred label: balance sheets @en