fall (ned)
type: Concept
source: Suomen kielen perussanakirja
comment: 1) liikkua painovoiman vaikutuksesta (nopeasti) alaspäin, maata kohti; 2) laskeutua, aleta, madaltua, painua; 3) joutua (huomattavasti) alempaan arvoasemaan; 4) vähetä (nopeasti, runsaasti) määrältäään, arvoltaan tms.
alternative label: fall (omkull)
alternative label: falla omkull
alternative label: fall
alternative label: falla ner
broader: motionering
in scheme: conceptscheme
preferred label: putoaminen @fi
preferred label: falling @en
related: fall (omkull)

motionering
type: Concept
narrower: fall (ned)
preferred label: bodily exercise @en
preferred label: liikkuminen @fi

fall (omkull)
type: Concept
preferred label: falling @en
preferred label: kaatuminen @fi
related: fall (ned)