formalismi (aatteet)
type: Concept
source: Kielitoimiston sanakirja
comment: (fil.) loogista rakennetta korostava suuntaus
alternative label: formalismi
broader: aatteet
in scheme: conceptscheme
preferred label: formalism @en
preferred label: formalism (filosofi) @sv

aatteet
type: Concept
narrower: formalismi (aatteet)
preferred label: tankar (idéer) @sv
preferred label: ideas @en