humanitaarinen interventio
type: Concept
source: Lähde: Encyclopaedia iuridica Fennica. 6
broader: interventio
in scheme: conceptscheme
preferred label: humanitär intervention @sv
preferred label: humanitarian intervention @en
scope note: Tarkoittaa valtion asevoimien tunkeutumista toisen valtion alueelle tarkoituksena estää jälkimmäisessä tapahtuva vakava ihmisoikeuksien loukkaaminen

interventio
type: Concept
narrower: humanitaarinen interventio
preferred label: intervention @en