creosote
type: Concept
comment: Kreosootti on vanhin käytössä oleva puunsuoja-aine, sillä on kyllästetty puuta yli 150 vuotta. Kreosoottia valmistetaan kivihiilitervasta, joka on koksauksen tai kaupunkikaasun sivutuote. Eniten kreosoootilla on kyllästetty puhelin- ja sähköpylväitä sekä ratapölkkyjä. Työtekijöillä, jotka ovat altistuneet merkittävästi kivihiilipielle tai -tervalle, kuten koksaamoiden ja alumiinitehtaiden työntekijöillä, on todettu olevan kohonnut riski sairastua syöpään.
broader: wood preservatives
in scheme: conceptscheme
preferred label: kreosootti @fi
preferred label: kreosot @sv
related: pah compounds

pah compounds
type: Concept
preferred label: PAH-föreningar @sv
preferred label: PAH-yhdisteet @fi
related: creosote

wood preservatives
type: Concept
narrower: creosote
preferred label: träskyddsmedel @sv
preferred label: puunsuoja-aineet @fi