bibliografi (forskning)
type: Concept
source: MOT Suomi 1.0a
comment: kirjallisuustieteen haara, jonka tehtävänä on kirjojen luettelointi
alternative label: bibliografi
broader: vetenskaper (forskningsområden)
in scheme: conceptscheme
preferred label: bibliography @en
preferred label: bibliografia (erikoisala) @fi

vetenskaper (forskningsområden)
type: Concept
narrower: bibliografi (forskning)
preferred label: tieteet (erikoisala) @fi
preferred label: sciences @en