recent history
type: Concept
broader: history
in scheme: conceptscheme
preferred label: lähihistoria @fi
preferred label: närhistoria @sv
scope note: Tarkoittaa historiantutkimuksen osa-aluetta

history
type: Concept
narrower: recent history
preferred label: historia @sv