bosniska kriget
type: Concept
source: Lähde: Wikipedia
alternative label: Bosnienkriget
broader: jugoslaviska krigen
broader: krig
in scheme: conceptscheme
preferred label: Bosnian War @en
preferred label: Bosnian sota @fi
scope note: Bosnian sota käytiin v. 1992-1995 serbien, kroaattien ja bosniakkien eli Bosnian muslimien välillä

krig
type: Concept
narrower: bosniska kriget
preferred label: sodat (tapahtumat) @fi
preferred label: wars @en

jugoslaviska krigen
type: Concept
narrower: bosniska kriget
preferred label: Jugoslavian hajoamissodat @fi