Arctic rasberry
type: Concept
source: Lähde: Mesimarjan ja jalomaaraimen viljely
alternative label: All-Fieldberry
broader: cultivated berries
in scheme: conceptscheme
preferred label: jalomaarain @fi
preferred label: allåkerbär @sv
related: arctic bramble
scope note: Jalomaarain on kahden luonnonvaraisena kasvavan mesimarjan alalajin, pohjoismaisen mesimarjan ja alaskan mesimarjan risteytys

arctic bramble
type: Concept
preferred label: åkerbär @sv
preferred label: mesimarja @fi
related: Arctic rasberry

cultivated berries
type: Concept
narrower: Arctic rasberry
preferred label: odlade bär @sv
preferred label: viljellyt marjat @fi