seuraukset
type: Concept
source: Kielitoimiston sanakirja
comment: 1) se (us. kielteinen seikka), mikä jstak seuraa, johtuu, aiheutuu; 2) (fil.) päätelmä joka loogisesti seuraa tietyistä premisseistä
broader: muu rooli
in scheme: conceptscheme
preferred label: följder @sv
preferred label: consequences @en
related: vaikutukset

muu rooli
type: Concept
narrower: seuraukset
preferred label: annan roll @sv
preferred label: other role @en

vaikutukset
type: Concept
preferred label: effects @en
preferred label: effekter @sv
related: seuraukset