byggnadsrätt (byggnadsverksamhet)
type: Concept
alternative label: byggnadsrätt -- byggnadsverksamhet
broader: rättigheter
in scheme: conceptscheme
preferred label: permitted building volume @en
preferred label: rakennusoikeus @fi
scope note: Används i betydelsen rätt att bygga. Termen byggnadsrätt (rättsområde) avser rättsområde.
scope note: Tarkoittaa oikeutta rakentamiseen. Oikeudenalaa tarkoitettaessa käytä rakentamisoikeus

rättigheter
type: Concept
narrower: byggnadsrätt (byggnadsverksamhet)
preferred label: oikeudet (edut) @fi
preferred label: rights @en