asennot
type: Concept
source: Kielitoimiston sanakirja
comment: 1) ruumiin t. sen osan t. osien (hetkellinen) sijaintitapa; 2) esineiden sijaintitavasta
broader: ulkoiset ominaisuudet
in scheme: conceptscheme
narrower: työasennot
preferred label: positions @en
preferred label: kroppsställningar @sv

ulkoiset ominaisuudet
type: Concept
narrower: asennot
preferred label: external properties @en
preferred label: yttre egenskaper @sv

työasennot
type: Concept
broader: asennot
preferred label: working positions @en
preferred label: arbetsställningar @sv