social ekonomi
type: Concept
preferred label: community economy @en
preferred label: yhteisötalous @fi
related: sociala företag

sociala företag
type: Concept
source: Lähde: Ekholm, Elina (toim.). Monikulttuurisia yrittäjiä
broader: företag
in scheme: conceptscheme
preferred label: sosiaaliset yritykset @fi
preferred label: social enterprises @en
related: arbetsandelslag
related: socialt entreprenörskap
related: social ekonomi
scope note: Sociala företag är å ena sidan företag som anställer handikappade och svårsysselsatta med nedsatt arbetsförmåga. Och å andra sidan skall de hjälpa personer, som är under hot att slås ut
scope note: Sosiaaliset yritykset voidaan jakaa kahteen ryhmään. 1) Yritykset, jotka integroivat työelämään henkilöitä, joilla on heikko ammatillinen pätevyys tai jotka ovat muuten syrjäytyneet perinteisestä palkkatyöstä. Tällaiset yritykset ovat yleensä yhdistyksiä tai osuuskuntia. 2) Yritykset, jotka tarjoavat sosiaalipalveluja heikommassa asemassa oleville sekä syrjäytyneille ryhmille että yksilöille

arbetsandelslag
type: Concept
preferred label: workers' cooperatives @en
preferred label: työosuuskunnat @fi
related: sociala företag

socialt entreprenörskap
type: Concept
preferred label: social entrepreneurship @en
preferred label: yhteiskunnallinen yrittäjyys @fi
related: sociala företag

yritykset toimintatavan mukaan
type: Collection
member: sociala företag

företag
type: Concept
narrower: sociala företag
preferred label: businesses @en
preferred label: yritykset @fi