ekologiska nätverk
type: Concept
preferred label: ecological networks @en
preferred label: ekologiset verkostot @fi

ekologiska korridorer
type: Concept
part of: ekologiska nätverk
broader: passager
in scheme: conceptscheme
preferred label: ecological corridors @en
preferred label: ekologiset käytävät @fi
scope note: Tarkoittaa esim. metsäalueita, metsäketjuja tai vesiväylien varsia, joita pitkin eliöt voivat siirtyä ydinalueelta toiselle

passager
type: Concept
narrower: ekologiska korridorer
preferred label: thoroughfares @en
preferred label: kulkuväylät @fi