Paasitorni
type: Concept
broader: byggnader
in scheme: conceptscheme
scope note: Helsingin työväenyhdistyksen talo Hakaniemessä

byggnader
type: Concept
narrower: Paasitorni
preferred label: buildings @en
preferred label: rakennukset @fi