COST 306 (projekt)
type: Concept
source: http://cordis.europa.eu/cost-transport/src/cost-306.htm
comment: COST 306: Automatic Transmission of Data Relating to Transport
broader: projekt
in scheme: conceptscheme
preferred label: COST 306 -projekti @fi

projekt
type: Concept
narrower: COST 306 (projekt)
preferred label: projects @en
preferred label: projektit @fi