microsatellites
type: Concept
source: Lähde: Biologian sanakirja
broader: organic structure
in scheme: conceptscheme
preferred label: microsatelliter @sv
preferred label: mikrosatelliitit @fi
related: markers
scope note: Kaikkien aitotumaisten eliöiden DNA:ssa esiintyviä, toistuvia, hyvin lyhyitä jaksoja, joiden toistumistiheys muuttuu usein. Mikrosatelliitteja käytetään markkereina geneettisessä kartoituksessa sekä laadittaessa DNA-sormenjälkiä

markers
type: Concept
preferred label: markörer @sv
preferred label: markkerit @fi
related: microsatellites

organic structure
type: Concept
narrower: microsatellites
preferred label: organisk struktur @sv
preferred label: orgaaninen rakenne @fi