Battles of Svensksund
type: Concept
broader: battles
in scheme: conceptscheme
preferred label: slaget vid Svensksund @sv
preferred label: Ruotsinsalmen taistelut @fi
related: Russo-Swedish War (1788-1790)
scope note: Kuutsalon ja Tiutisen saarten välisessä Ruotsinsalmessa Kotkan kaakkoispuolella elokuussa 1789 ja heinäkuussa 1790 Ruotsin ja Venäjän laivastojen välillä käydyt meritaistelut

Russo-Swedish War (1788-1790)
type: Concept
preferred label: Gustaf III:s krig @sv
preferred label: Kustaa III:n sota @fi
related: Battles of Svensksund

battles
type: Concept
narrower: Battles of Svensksund
preferred label: strider @sv
preferred label: taistelut @fi