Malminkartano manor
type: Concept
broader: manors
in scheme: conceptscheme
preferred label: Malmgård @sv
preferred label: Malminkartano @fi
scope note: Kartano Helsingissä. Kaupunginosaa tarkoitettaessa käytä Helsinki -- Malminkartano

manors
type: Concept
narrower: Malminkartano manor
preferred label: herrgårdar @sv
preferred label: kartanot @fi