yritysmarkkinointi
type: Concept
alternative label: business-to-business-markkinointi
alternative label: business-to-business-marknadsföring @sv
broader: markkinointi
in scheme: conceptscheme
preferred label: corporate marketing @en
preferred label: företagsmarknadsföring @sv
scope note: Tarkoittaa yritysten välistä markkinointia

markkinointi
type: Concept
narrower: yritysmarkkinointi
preferred label: marketing @en
preferred label: marknadsföring @sv