selkäranka
type: Concept
preferred label: spine @en
preferred label: ryggraden @sv

nikamavälilevy
type: Concept
source: MOT Lääketiede 2.0a
part of: selkäranka
comment: nikamansolmujen välinen joustava rustolevy, jossa on sitkeä syykehä (anulus fibrosus) ja pehmeämpi ydin (nucleus pulposus)
alternative label: välilevy
broader: tuki- ja liikuntaelimet
in scheme: conceptscheme
preferred label: intervertebral disk @en
preferred label: mellankotskivan @sv

tuki- ja liikuntaelimet
type: Concept
narrower: nikamavälilevy
preferred label: rörelseorganen @sv
preferred label: musculoskeletal system @en