ADSL
type: Concept
alternative label: asymmetric digital subscriber line
broader: tekniset järjestelmät
in scheme: conceptscheme
preferred label: adsl @en
related: tiedonsiirto
scope note: Kierrettyä parikaapelia hyödyntävä tiedonsiirtoyhteys, jonka kapasiteetista suuri osa käytetään yleensä käyttäjälle päin tulevan tiedon siirtoon

tekniset järjestelmät
type: Concept
narrower: ADSL
preferred label: tekniska system @sv
preferred label: technical systems @en

tiedonsiirto
type: Concept
preferred label: data transmission @en
preferred label: dataöverföring @sv
related: ADSL