försörjningsbidrag
type: Concept
broader: utkomstskydd
in scheme: conceptscheme
preferred label: huoltoapu @fi
scope note: Käytetään vain historiallisessa yhteydessä, muussa tapauksessa käytä toimeentuloturva
scope note: Termen används enbart i historiska sammanhang. I andra sammanhang används utkomstskydd.

utkomstskydd
type: Concept
narrower: försörjningsbidrag
preferred label: livelihood security @en
preferred label: toimeentuloturva @fi