månader
type: Concept
broader: kalenderrelaterad tidsperiod
in scheme: conceptscheme
preferred label: months @en
preferred label: kuukaudet @fi
scope note: Kuukausien nimiä voi käyttää asiasanoina
scope note: Namn på månaderna kan användas som ämnesord.

kalenderrelaterad tidsperiod
type: Concept
narrower: månader
preferred label: period of time related to calendar @en
preferred label: kalenteriin liittyvä ajanjakso @fi