kuormat
type: Concept
source: Kielitoimiston sanakirja
comment: jossakin kuljetusneuvossa yhdellä kertaa kuljetettava tavara- t. ainemäärä
broader: määrä
in scheme: conceptscheme
preferred label: loads @en
preferred label: lass @sv

määrä
type: Concept
narrower: kuormat
preferred label: mängd (information) @sv
preferred label: amount @en