literary works
type: Concept
narrower: artists' books
preferred label: kirjalliset teokset @fi
preferred label: litterära verk @sv

artists' books
type: Concept
broader: literary works
in scheme: conceptscheme
preferred label: bokkonstverk @sv
preferred label: taiteilijakirjat @fi
scope note: Tarkoittaa kirjanmuotoista taiteilijan tekemää kuvataideteosta