häradsrätter
type: Concept
broader: underrätter
in scheme: conceptscheme
preferred label: kihlakunnanoikeudet @fi
preferred label: rural district courts @en
related: tingsrätter
scope note: Käräjäoikeuksista vuoteen 1994 käytetty nimitys
scope note: Benämningen på tingsrätterna fram till år 1994

tingsrätter
type: Concept
preferred label: käräjäoikeudet @fi
preferred label: district courts @en
related: häradsrätter

underrätter
type: Concept
narrower: häradsrätter
preferred label: inferior courts @en
preferred label: alioikeudet @fi