konvergens
type: Concept
source: Lähde: Valpola, V. Suuri sivistyssanakirja
source: Kielitoimiston sanakirja
comment: yhteen suuntautuminen, lähentyminen, yhtyminen
broader: förändring
in scheme: conceptscheme
preferred label: convergence @en
preferred label: konvergenssi @fi
scope note: YSA: Termillä on useita merkityksiä. 1) Yhteen suuntautuminen, lähestyminen. 2) Kehittyminen kohti samaa lopputilaa. 3) Biologiassa eri alkuperää olevien eliölajien kehittyminen samaan suuntaan ympäristön vaikutuksesta. 4) Kielitieteessä eri kielten kehittyminen samaan lopputilaan. 5) Matematiikassa päättymättömän lukujonon läheneminen raja-arvoon siten, että erotus voidaan saada kuinka pieneksi tahansa menemällä tarpeeksi pitkälle

förändring
type: Concept
narrower: konvergens
preferred label: change @en
preferred label: muutos @fi