vetenskapliga namn
type: Concept
broader: benämningar
in scheme: conceptscheme
preferred label: tieteelliset nimet @fi
preferred label: scientific names @en
scope note: Namnen på alla levande organismers namn kan användas som ämnesord
scope note: Eliökunnan kaikkia tieteellisiä nimiä voi käyttää asiasanoina

benämningar
type: Concept
narrower: vetenskapliga namn
preferred label: appellations @en
preferred label: nimitykset @fi