numerologi
type: Concept
source: Kielitoimiston sanakirja
comment: oppi numerojen maagisista ominaisuuksista
alternative label: talsymbolik
alternative label: lukumystiikka @fi
alternative label: lukusymboliikka @fi
alternative label: talmystik
broader: ockultism
in scheme: conceptscheme
preferred label: numerologia @fi
preferred label: numerology @en

ockultism
type: Concept
narrower: numerologi
preferred label: occultism @en
preferred label: okkultismi @fi