Messianic Jews
type: Concept
broader: Judaism
in scheme: conceptscheme
preferred label: messianska judar @sv
preferred label: messiaaniset juutalaiset @fi
scope note: Messiaaniseen juutalaisuuteen kuuluvat synagoogat noudattavat juutalaista synagoogajumalanpalvelusta, ympärileikkausta ja tapakulttuuria, mutta korostavat historiallisen Jeesuksen messiaanisuutta

Judaism
type: Concept
narrower: Messianic Jews
preferred label: judendom @sv
preferred label: juutalaisuus @fi